Target
Bone morphogenetic protein 1
Ligand
BDBM50130128
Substrate
Meas. Tech.
ChEBML_158896
Ki
105±n/a nM
Citation
 Robinson, LAWilson, DMDelaet, NGBradley, EKDankwardt, SMCampbell, JAMartin, RLVan Wart, HEWalker, KASullivan, RW Novel inhibitors of procollagen C-proteinase. Part 2: glutamic acid hydroxamates. Bioorg Med Chem Lett 13:2381-4 (2003)  
Target
Name:
Bone morphogenetic protein 1
Synonyms:
BMP-1 BMP1_HUMAN PCOLC Procollagen C-proteinase | mTld
Type:
PROTEIN
Mol. Mass.:
111254.03
Organism:
Homo sapiens (Human)
Description:
ChEMBL_518962
Residue:
986
  
Inhibitor
Name:
BDBM50130128
Synonyms:
4-{(R)-4-[Benzo[1,3]dioxol-5-ylmethyl-(4-methoxy-benzenesulfonyl)-amino]-4-hydroxycarbamoyl-butyryl}-piperazine-1-carboxylic acid (3-methoxy-phenyl)-amide | CHEMBL263240
Type:
Small organic molecule
Emp. Form.:
C32H37N5O10S
Mol. Mass.:
683.729
SMILES:
COc1ccc(cc1)S(=O)(=O)N(Cc1ccc2OCOc2c1)[C@H](CCC(=O)N1CCN(CC1)C(=O)Nc1cccc(OC)c1)C(=O)NO
: