Target
Bone morphogenetic protein 1
Ligand
BDBM50130129
Substrate
Meas. Tech.
ChEBML_158896
Ki
340±n/a nM
Citation
 Robinson, LAWilson, DMDelaet, NGBradley, EKDankwardt, SMCampbell, JAMartin, RLVan Wart, HEWalker, KASullivan, RW Novel inhibitors of procollagen C-proteinase. Part 2: glutamic acid hydroxamates. Bioorg Med Chem Lett 13:2381-4 (2003)  
Target
Name:
Bone morphogenetic protein 1
Synonyms:
BMP-1 BMP1_HUMAN PCOLC Procollagen C-proteinase | mTld
Type:
PROTEIN
Mol. Mass.:
111254.03
Organism:
Homo sapiens (Human)
Description:
ChEMBL_518962
Residue:
986
  
Inhibitor
Name:
BDBM50130129
Synonyms:
(R)-2-[Benzo[1,3]dioxol-5-ylmethyl-(4-methoxy-benzenesulfonyl)-amino]-5-oxo-5-(4-phenyl-piperazin-1-yl)-pentanoic acid hydroxyamide | CHEMBL309947
Type:
Small organic molecule
Emp. Form.:
C30H34N4O8S
Mol. Mass.:
610.678
SMILES:
COc1ccc(cc1)S(=O)(=O)N(Cc1ccc2OCOc2c1)[C@H](CCC(=O)N1CCN(CC1)c1ccccc1)C(=O)NO
: