Target
Bone morphogenetic protein 1
Ligand
BDBM50130132
Substrate
Meas. Tech.
ChEBML_158896
Ki
90±n/a nM
Citation
 Robinson, LAWilson, DMDelaet, NGBradley, EKDankwardt, SMCampbell, JAMartin, RLVan Wart, HEWalker, KASullivan, RW Novel inhibitors of procollagen C-proteinase. Part 2: glutamic acid hydroxamates. Bioorg Med Chem Lett 13:2381-4 (2003)  
Target
Name:
Bone morphogenetic protein 1
Synonyms:
BMP-1 BMP1_HUMAN PCOLC Procollagen C-proteinase | mTld
Type:
PROTEIN
Mol. Mass.:
111254.03
Organism:
Homo sapiens (Human)
Description:
ChEMBL_518962
Residue:
986
  
Inhibitor
Name:
BDBM50130132
Synonyms:
4-{(R)-4-[Benzo[1,3]dioxol-5-ylmethyl-(4-methoxy-benzenesulfonyl)-amino]-4-hydroxycarbamoyl-butyryl}-piperazine-1-carboxylic acid (4-methoxy-phenyl)-amide | CHEMBL307075
Type:
Small organic molecule
Emp. Form.:
C32H37N5O10S
Mol. Mass.:
683.729
SMILES:
COc1ccc(NC(=O)N2CCN(CC2)C(=O)CC[C@@H](N(Cc2ccc3OCOc3c2)S(=O)(=O)c2ccc(OC)cc2)C(=O)NO)cc1
: