Target
Thyroid hormone receptor beta
Ligand
BDBM50130597
Substrate
Meas. Tech.
ChEMBL_210504 (CHEMBL811899)
Kd
1.26±n/a nM
Citation
 Yoshihara, HAApriletti, JWBaxter, JDScanlan, TS Structural determinants of selective thyromimetics. J Med Chem 46:3152-61 (2003)  
Target
Name:
Thyroid hormone receptor beta
Synonyms:
ERBA2 Nuclear receptor subfamily 1 group A member 2 THR1 c-erbA-2 | c-erbA-beta
Type:
Receptor
Mol. Mass.:
52793.62
Organism:
Homo sapiens (Human)
Description:
Recombinant hThR was obtained from nuclear extracts from SF9 cells infected with baculovirus vectors encoding for ThRbeta 1.
Residue:
461
  
Inhibitor
Name:
BDBM50130597
Synonyms:
2-Amino-3-[4-(4-hydroxy-3-isopropyl-benzyl)-3,5-dimethyl-phenyl]-propionic acid | CHEMBL110335
Type:
Small organic molecule
Emp. Form.:
C21H27NO3
Mol. Mass.:
341.444
SMILES:
CC(C)c1cc(Cc2c(C)cc(C[C@H](N)C(O)=O)cc2C)ccc1O
: