Target
Bromodomain-containing protein 4
Ligand
BDBM50566697
Substrate
Meas. Tech.
ChEMBL_2101545 (CHEMBL4809941)
Kd
1.3±n/a nM
Citation
 Harrison, LAAtkinson, SJBassil, AChung, CWGrandi, PGray, JRJLevernier, ELewis, ALugo, DMessenger, CMichon, AMMitchell, DJPreston, APrinjha, RKRioja, ISeal, JTTaylor, SWall, IDWatson, RJWoolven, JMDemont, EH Identification of a Series of  J Med Chem 64:10742-10771 (2021)  
Target
Name:
Bromodomain-containing protein 4
Synonyms:
BRD4 Bromodomain-containing protein 4 (BRD4) Protein HUNK1
Type:
Protein
Mol. Mass.:
152264.84
Organism:
Homo sapiens (Human)
Description:
O60885
Residue:
1362
  
Inhibitor
Name:
BDBM50566697
Synonyms:
CHEMBL4862372
Type:
Small organic molecule
Emp. Form.:
C19H21N3O3
Mol. Mass.:
339.3883
SMILES:
CNC(=O)c1cc(cc(n1)C(O)c1ccccc1)C(=O)N[C@H]1C[C@@H]1C
: