Target
Receptor-type tyrosine-protein phosphatase alpha
Ligand
BDBM15819
Substrate
Meas. Tech.
ChEMBL_207134 (CHEMBL805118)
Ki
380±n/a nM
Citation
 Liu, GXin, ZLiang, HAbad-Zapatero, CHajduk, PJJanowick, DASzczepankiewicz, BGPei, ZHutchins, CWBallaron, SJStashko, MALubben, THBerg, CERondinone, CMTrevillyan, JMJirousek, MR Selective protein tyrosine phosphatase 1B inhibitors: targeting the second phosphotyrosine binding site with non-carboxylic acid-containing ligands. J Med Chem 46:3437-40 (2003)  
Target
Name:
Receptor-type tyrosine-protein phosphatase alpha
Synonyms:
PTPA PTPRA_HUMAN Protein-tyrosine phosphatase alpha
Type:
Enzyme
Mol. Mass.:
90719.02
Organism:
Homo sapiens (Human)
Description:
P18433
Residue:
802
  
Inhibitor
Name:
BDBM15819
Synonyms:
1:1 mixture of diastereomers CHEMBL55243 | oxalyl-aryl-amino benzoic acid-based inhibitor 19
Type:
Small organic molecule
Emp. Form.:
C32H40N4O10S
Mol. Mass.:
672.746
SMILES:
CCc1cc(CC(NC(C)=O)C(=O)NCCCCC(=O)N[C@@H](CCSC)C(O)=O)ccc1N(C(=O)C(O)=O)c1ccccc1C(O)=O
: