Target
Cyclin-C
Ligand
BDBM50567855
Substrate
Meas. Tech.
ChEMBL_2103907 (CHEMBL4812410)
Ki
5.0±n/a nM
Citation
 Yu, MLong, YYang, YLi, MTeo, TNoll, BPhilip, SWang, S Discovery of a potent, highly selective, and orally bioavailable inhibitor of CDK8 through a structure-based optimisation. Eur J Med Chem 218:0 (2021)  
Target
Name:
Cyclin-C
Synonyms:
CCNC Cyclin C hSRB11
Type:
PROTEIN
Mol. Mass.:
33244.88
Organism:
Homo sapiens (Human)
Description:
ChEMBL_107900
Residue:
283
  
Inhibitor
Name:
BDBM50567855
Synonyms:
CHEMBL4871899
Type:
Small organic molecule
Emp. Form.:
C23H22ClN3OS
Mol. Mass.:
423.958
SMILES:
Clc1cncc(-c2ccc(s2)-c2ccccc2)c1N1CCC2(CCNC2=O)CC1
: