Target
Peroxisome proliferator-activated receptor gamma
Ligand
BDBM50133115
Substrate
Meas. Tech.
ChEMBL_154539 (CHEMBL760259)
Ki
>10000±n/a nM
Citation
 Michellys, PYArdecky, RJChen, JHD'Arrigo, JGrese, TAKaranewsky, DSLeibowitz, MDLiu, SMais, DAMapes, CMMontrose-Rafizadeh, COgilvie, KMReifel-Miller, ARungta, DThompson, AWTyhonas, JSBoehm, MF Design, synthesis, and structure-activity relationship studies of novel 6,7-locked-[7-(2-alkoxy-3,5-dialkylbenzene)-3-methylocta]-2,4,6-trienoic acids. J Med Chem 46:4087-103 (2003)  
Target
Name:
Peroxisome proliferator-activated receptor gamma
Synonyms:
Nr1c3 Pparg
Type:
PROTEIN
Mol. Mass.:
57562.54
Organism:
Rattus norvegicus
Description:
ChEMBL_642067
Residue:
505
  
Inhibitor
Name:
BDBM50133115
Synonyms:
5-[2'-(3-Fluoro-propoxy)-3',5'-diisopropyl-biphenyl-2-yl]-3-methyl-penta-2,4-dienoic acid | CHEMBL445634
Type:
Small organic molecule
Emp. Form.:
C27H33FO3
Mol. Mass.:
424.5475
SMILES:
CC(C)c1cc(C(C)C)c(OCCCF)c(c1)-c1ccccc1\C=C\C(\C)=C\C(O)=O
: