Target
Retinoic acid receptor beta
Ligand
BDBM50133115
Substrate
Meas. Tech.
ChEMBL_195644 (CHEMBL795962)
Ki
>10000±n/a nM
Citation
 Michellys, PYArdecky, RJChen, JHD'Arrigo, JGrese, TAKaranewsky, DSLeibowitz, MDLiu, SMais, DAMapes, CMMontrose-Rafizadeh, COgilvie, KMReifel-Miller, ARungta, DThompson, AWTyhonas, JSBoehm, MF Design, synthesis, and structure-activity relationship studies of novel 6,7-locked-[7-(2-alkoxy-3,5-dialkylbenzene)-3-methylocta]-2,4,6-trienoic acids. J Med Chem 46:4087-103 (2003)  
Target
Name:
Retinoic acid receptor beta
Synonyms:
HAP NR1B2 RAR-beta RARB Retinoic acid receptor RXR-alpha/Retinoic acid receptor beta Retinoid receptor
Type:
PROTEIN
Mol. Mass.:
50498.70
Organism:
Homo sapiens (Human)
Description:
ChEMBL_1458015
Residue:
455
  
Inhibitor
Name:
BDBM50133115
Synonyms:
5-[2'-(3-Fluoro-propoxy)-3',5'-diisopropyl-biphenyl-2-yl]-3-methyl-penta-2,4-dienoic acid | CHEMBL445634
Type:
Small organic molecule
Emp. Form.:
C27H33FO3
Mol. Mass.:
424.5475
SMILES:
CC(C)c1cc(C(C)C)c(OCCCF)c(c1)-c1ccccc1\C=C\C(\C)=C\C(O)=O
: