Target
Retinoic acid receptor, alpha, isoform CRA_b
Ligand
BDBM50133128
Substrate
Meas. Tech.
ChEMBL_195190 (CHEMBL802723)
Ki
3726±n/a nM
Citation
 Michellys, PYArdecky, RJChen, JHD'Arrigo, JGrese, TAKaranewsky, DSLeibowitz, MDLiu, SMais, DAMapes, CMMontrose-Rafizadeh, COgilvie, KMReifel-Miller, ARungta, DThompson, AWTyhonas, JSBoehm, MF Design, synthesis, and structure-activity relationship studies of novel 6,7-locked-[7-(2-alkoxy-3,5-dialkylbenzene)-3-methylocta]-2,4,6-trienoic acids. J Med Chem 46:4087-103 (2003)  
Target
Name:
Retinoic acid receptor, alpha, isoform CRA_b
Synonyms:
Retinoic acid receptor alpha
Type:
PROTEIN
Mol. Mass.:
50955.52
Organism:
Rattus norvegicus
Description:
ChEMBL_195190
Residue:
459
  
Inhibitor
Name:
BDBM50133128
Synonyms:
5-{2-[2-(2,2-Difluoro-ethoxy)-3,5-diisopropyl-phenyl]-cyclopent-1-enyl}-3-methyl-penta-2,4-dienoic acid | CHEMBL340074
Type:
Small organic molecule
Emp. Form.:
C25H32F2O3
Mol. Mass.:
418.5166
SMILES:
CC(C)c1cc(C(C)C)c(OCC(F)F)c(c1)C1=C(CCC1)\C=C\C(\C)=C\C(O)=O
: