Target
Retinoic acid receptor, alpha, isoform CRA_b
Ligand
BDBM50133121
Substrate
Meas. Tech.
ChEMBL_195190 (CHEMBL802723)
Ki
5650.0±n/a nM
Citation
 Michellys, PYArdecky, RJChen, JHD'Arrigo, JGrese, TAKaranewsky, DSLeibowitz, MDLiu, SMais, DAMapes, CMMontrose-Rafizadeh, COgilvie, KMReifel-Miller, ARungta, DThompson, AWTyhonas, JSBoehm, MF Design, synthesis, and structure-activity relationship studies of novel 6,7-locked-[7-(2-alkoxy-3,5-dialkylbenzene)-3-methylocta]-2,4,6-trienoic acids. J Med Chem 46:4087-103 (2003)  
Target
Name:
Retinoic acid receptor, alpha, isoform CRA_b
Synonyms:
Retinoic acid receptor alpha
Type:
PROTEIN
Mol. Mass.:
50955.52
Organism:
Rattus norvegicus
Description:
ChEMBL_195190
Residue:
459
  
Inhibitor
Name:
BDBM50133121
Synonyms:
5-{3-[3-tert-Butyl-2-(2,2-difluoro-ethoxy)-5-ethyl-phenyl]-thiophen-2-yl}-3-methyl-penta-2,4-dienoic acid | CHEMBL129887
Type:
Small organic molecule
Emp. Form.:
C24H28F2O3S
Mol. Mass.:
434.539
SMILES:
CCc1cc(-c2ccsc2\C=C\C(\C)=C\C(O)=O)c(OCC(F)F)c(c1)C(C)(C)C
: