Target
Progesterone receptor
Ligand
BDBM50133135
Substrate
Meas. Tech.
ChEMBL_159730 (CHEMBL766187)
Ki
0.59±n/a nM
Citation
 Zhi, LTegley, CMPio, BEdwards, JPMotamedi, MJones, TKMarschke, KBMais, DERisek, BSchrader, WT 5-benzylidene-1,2-dihydrochromeno[3,4-f]quinolines as selective progesterone receptor modulators. J Med Chem 46:4104-12 (2003)  
Target
Name:
Progesterone receptor
Synonyms:
NR3C3 PGR PRGR_HUMAN | progesterone
Type:
Protein
Mol. Mass.:
98979.52
Organism:
Homo sapiens (Human)
Description:
P06401
Residue:
933
  
Inhibitor
Name:
BDBM50133135
Synonyms:
9-Fluoro-2,2,4-trimethyl-5-[1-(2-methylsulfanyl-phenyl)-meth-(Z)-ylidene]-2,5-dihydro-1H-6-oxa-1-aza-chrysene | CHEMBL422444
Type:
Small organic molecule
Emp. Form.:
C27H24FNOS
Mol. Mass.:
429.549
SMILES:
CSc1ccccc1\C=C1/Oc2ccc(F)cc2-c2ccc3NC(C)(C)C=C(C)c3c12
: