Target
Adenosine receptor A1
Ligand
BDBM50133360
Substrate
Meas. Tech.
ChEMBL_27900 (CHEMBL640560)
Ki
142±n/a nM
Citation
 Pastorin, GDa Ros, TSpalluto, GDeflorian, FMoro, SCacciari, BBaraldi, PGGessi, SVarani, KBorea, PA Pyrazolo[4,3-e]-1,2,4-triazolo[1,5-c]pyrimidine derivatives as adenosine receptor antagonists. Influence of the N5 substituent on the affinity at the human A 3 and A 2B adenosine receptor subtypes: a molecular modeling investigation. J Med Chem 46:4287-96 (2003)  
Target
Name:
Adenosine receptor A1
Synonyms:
A1 adenosine receptor (hA1) AA1R_HUMAN ADORA1 Adenosine A1-receptor Adenosine receptor A1 (hA1) | Adenosine transporter (AdT)
Type:
G Protein-Coupled Receptor (GPCR)
Mol. Mass.:
36520.92
Organism:
Homo sapiens (Human)
Description:
P30542
Residue:
326
  
Inhibitor
Name:
BDBM50133360
Synonyms:
CHEMBL336217 | N-[2-Furan-2-yl-8-(3-methyl-butyl)-8H-pyrazolo[4,3-e][1,2,4]triazolo[1,5-c]pyrimidin-5-yl]-2-naphthalen-1-yl-acetamide
Type:
Small organic molecule
Emp. Form.:
C27H25N7O2
Mol. Mass.:
479.5331
SMILES:
CC(C)CCn1cc2c(n1)nc(NC(=O)Cc1cccc3ccccc13)n1nc(nc21)-c1ccco1
: