Target
Adenosine receptor A3
Ligand
BDBM50133362
Substrate
Meas. Tech.
ChEMBL_29890 (CHEMBL641961)
Ki
81±n/a nM
Citation
 Pastorin, GDa Ros, TSpalluto, GDeflorian, FMoro, SCacciari, BBaraldi, PGGessi, SVarani, KBorea, PA Pyrazolo[4,3-e]-1,2,4-triazolo[1,5-c]pyrimidine derivatives as adenosine receptor antagonists. Influence of the N5 substituent on the affinity at the human A 3 and A 2B adenosine receptor subtypes: a molecular modeling investigation. J Med Chem 46:4287-96 (2003)  
Target
Name:
Adenosine receptor A3
Synonyms:
A3 adenosine receptor (hA3) ADORA3 | Adenosine A3 receptor (A3AR)
Type:
G Protein-Coupled Receptor (GPCR)
Mol. Mass.:
36197.32
Organism:
Homo sapiens (Human)
Description:
P0DMS8
Residue:
318
  
Inhibitor
Name:
BDBM50133362
Synonyms:
CHEMBL132806 | N-[2-Furan-2-yl-8-(3-methyl-butyl)-8H-pyrazolo[4,3-e][1,2,4]triazolo[1,5-c]pyrimidin-5-yl]-2-phenyl-acetamide
Type:
Small organic molecule
Emp. Form.:
C23H23N7O2
Mol. Mass.:
429.4744
SMILES:
CC(C)CCn1cc2c(n1)nc(NC(=O)Cc1ccccc1)n1nc(nc21)-c1ccco1
: