Target
Adenosine receptor A2b
Ligand
BDBM50133368
Substrate
Meas. Tech.
ChEMBL_30602 (CHEMBL642009)
Ki
20±n/a nM
Citation
 Pastorin, GDa Ros, TSpalluto, GDeflorian, FMoro, SCacciari, BBaraldi, PGGessi, SVarani, KBorea, PA Pyrazolo[4,3-e]-1,2,4-triazolo[1,5-c]pyrimidine derivatives as adenosine receptor antagonists. Influence of the N5 substituent on the affinity at the human A 3 and A 2B adenosine receptor subtypes: a molecular modeling investigation. J Med Chem 46:4287-96 (2003)  
Target
Name:
Adenosine receptor A2b
Synonyms:
AA2BR_HUMAN ADORA2B Adenosine receptors A2b | Adenosine receptors; A2a & A2b
Type:
G Protein-Coupled Receptor (GPCR)
Mol. Mass.:
36341.22
Organism:
Homo sapiens (Human)
Description:
Residue:
332
  
Inhibitor
Name:
BDBM50133368
Synonyms:
CHEMBL335950 N-[2-Furan-2-yl-8-(3-phenyl-propyl)-8H-pyrazolo[4,3-e][1,2,4]triazolo[1,5-c]pyrimidin-5-yl]-2-naphthalen-1-yl-acetamide
Type:
Small organic molecule
Emp. Form.:
C31H25N7O2
Mol. Mass.:
527.5759
SMILES:
O=C(Cc1cccc2ccccc12)Nc1nc2nn(CCCc3ccccc3)cc2c2nc(nn12)-c1ccco1
: