Target
Adenosine receptor A2b
Ligand
BDBM50109453
Substrate
Meas. Tech.
ChEMBL_30602 (CHEMBL642009)
Ki
165±n/a nM
Citation
 Pastorin, GDa Ros, TSpalluto, GDeflorian, FMoro, SCacciari, BBaraldi, PGGessi, SVarani, KBorea, PA Pyrazolo[4,3-e]-1,2,4-triazolo[1,5-c]pyrimidine derivatives as adenosine receptor antagonists. Influence of the N5 substituent on the affinity at the human A 3 and A 2B adenosine receptor subtypes: a molecular modeling investigation. J Med Chem 46:4287-96 (2003)  
Target
Name:
Adenosine receptor A2b
Synonyms:
AA2BR_HUMAN ADORA2B Adenosine receptors A2b | Adenosine receptors; A2a & A2b
Type:
G Protein-Coupled Receptor (GPCR)
Mol. Mass.:
36341.22
Organism:
Homo sapiens (Human)
Description:
Residue:
332
  
Inhibitor
Name:
BDBM50109453
Synonyms:
CHEMBL341376 N-(2-Furan-2-yl-8-methyl-8H-pyrazolo[4,3-e][1,2,4]triazolo[1,5-c]pyrimidin-5-yl)-2-phenyl-acetamide | N-[2-Furan-2-yl-8-(3-phenyl-propyl)-2,8-dihydro-3H-pyrazolo[4,3-e][1,2,4]triazolo[1,5-c]pyrimidin-5-yl]-2-phenoxy-acetamide
Type:
Small organic molecule
Emp. Form.:
C19H15N7O2
Mol. Mass.:
373.3681
SMILES:
Cn1cc2c(n1)nc(NC(=O)Cc1ccccc1)n1nc(nc21)-c1ccco1
: