Target
Adenosine receptor A3
Ligand
BDBM50133363
Substrate
Meas. Tech.
ChEMBL_29890 (CHEMBL641961)
Ki
45±n/a nM
Citation
 Pastorin, GDa Ros, TSpalluto, GDeflorian, FMoro, SCacciari, BBaraldi, PGGessi, SVarani, KBorea, PA Pyrazolo[4,3-e]-1,2,4-triazolo[1,5-c]pyrimidine derivatives as adenosine receptor antagonists. Influence of the N5 substituent on the affinity at the human A 3 and A 2B adenosine receptor subtypes: a molecular modeling investigation. J Med Chem 46:4287-96 (2003)  
Target
Name:
Adenosine receptor A3
Synonyms:
A3 adenosine receptor (hA3) ADORA3 | Adenosine A3 receptor (A3AR)
Type:
G Protein-Coupled Receptor (GPCR)
Mol. Mass.:
36197.32
Organism:
Homo sapiens (Human)
Description:
P0DMS8
Residue:
318
  
Inhibitor
Name:
BDBM50133363
Synonyms:
CHEMBL541455 N-(2-Furan-2-yl-8-phenethyl-8H-pyrazolo[4,3-e][1,2,4]triazolo[1,5-c]pyrimidin-5-yl)-2-phenyl-acetamide
Type:
Small organic molecule
Emp. Form.:
C26H21N7O2
Mol. Mass.:
463.4906
SMILES:
O=C(Cc1ccccc1)Nc1nc2nn(CCc3ccccc3)cc2c2nc(nn12)-c1ccco1
: