Target
D(1B) dopamine receptor
Ligand
BDBM50292340
Substrate
Meas. Tech.
ChEMBL_2106121 (CHEMBL4814796)
Ki
>10000±n/a nM
Citation
 Creed, SMGutridge, AMArgade, MDHennessy, MRFriesen, JBPauli, GFvan Rijn, RMRiley, AP Isolation and Pharmacological Characterization of Six Opioidergic  J Nat Prod 84:71-80 (2021)  
Target
Name:
D(1B) dopamine receptor
Synonyms:
D(5) dopamine receptor DOPAMINE D5 DRD1L2 DRD5_HUMAN | dopamine receptor D5
Type:
Protein
Mol. Mass.:
52943.41
Organism:
Homo sapiens (Human)
Description:
P21918
Residue:
477
  
Inhibitor
Name:
BDBM50292340
Synonyms:
AKUAMMICINE | CHEMBL508955
Type:
Small organic molecule
Emp. Form.:
C20H22N2O2
Mol. Mass.:
322.4009
SMILES:
COC(=O)C1[C@H]2C[C@@H]3N(CC[C@]33C1=Nc1ccccc31)C\C2=C\C
: