Target
Mu-type opioid receptor
Ligand
BDBM50292340
Substrate
Meas. Tech.
ChEMBL_2106122 (CHEMBL4814797)
Ki
3162±n/a nM
Citation
 Creed, SMGutridge, AMArgade, MDHennessy, MRFriesen, JBPauli, GFvan Rijn, RMRiley, AP Isolation and Pharmacological Characterization of Six Opioidergic  J Nat Prod 84:71-80 (2021)  
Target
Name:
Mu-type opioid receptor
Synonyms:
M-OR-1 MOR-1 MUOR1 Mu opiate receptor OPRM1 hMOP | mu-type opioid receptor isoform MOR-1
Type:
G Protein-Coupled Receptor (GPCR)
Mol. Mass.:
44789.51
Organism:
Homo sapiens (Human)
Description:
P35372
Residue:
400
  
Inhibitor
Name:
BDBM50292340
Synonyms:
AKUAMMICINE | CHEMBL508955
Type:
Small organic molecule
Emp. Form.:
C20H22N2O2
Mol. Mass.:
322.4009
SMILES:
COC(=O)C1[C@H]2C[C@@H]3N(CC[C@]33C1=Nc1ccccc31)C\C2=C\C
: