Target
Delta-type opioid receptor
Ligand
BDBM50292340
Substrate
Meas. Tech.
ChEMBL_2106124 (CHEMBL4814799)
Ki
25119±n/a nM
Citation
 Creed, SMGutridge, AMArgade, MDHennessy, MRFriesen, JBPauli, GFvan Rijn, RMRiley, AP Isolation and Pharmacological Characterization of Six Opioidergic  J Nat Prod 84:71-80 (2021)  
Target
Name:
Delta-type opioid receptor
Synonyms:
D-OR-1 Delta opioid receptor OPIATE Delta OPRD1 OPRK1 | opioid receptor, delta 1
Type:
G Protein-Coupled Receptor (GPCR)
Mol. Mass.:
40382.98
Organism:
Homo sapiens (Human)
Description:
Competition binding assays were carried out using membrane preparations from transfected HN9.10 cells that constitutively expressed the delta opioid receptor.
Residue:
372
  
Inhibitor
Name:
BDBM50292340
Synonyms:
AKUAMMICINE | CHEMBL508955
Type:
Small organic molecule
Emp. Form.:
C20H22N2O2
Mol. Mass.:
322.4009
SMILES:
COC(=O)C1[C@H]2C[C@@H]3N(CC[C@]33C1=Nc1ccccc31)C\C2=C\C
: