Target
Delta-type opioid receptor
Ligand
BDBM50292340
Substrate
Meas. Tech.
ChEMBL_2106127 (CHEMBL4814802)
IC50
12400±n/a nM
Citation
 Creed, SMGutridge, AMArgade, MDHennessy, MRFriesen, JBPauli, GFvan Rijn, RMRiley, AP Isolation and Pharmacological Characterization of Six Opioidergic  J Nat Prod 84:71-80 (2021)  
Target
Name:
Delta-type opioid receptor
Synonyms:
DOR-1 MSL-2 OPRD_MOUSE Oprd1
Type:
Enzyme Catalytic Domain
Mol. Mass.:
40577.25
Organism:
MOUSE
Description:
P32300
Residue:
372
  
Inhibitor
Name:
BDBM50292340
Synonyms:
AKUAMMICINE | CHEMBL508955
Type:
Small organic molecule
Emp. Form.:
C20H22N2O2
Mol. Mass.:
322.4009
SMILES:
COC(=O)C1[C@H]2C[C@@H]3N(CC[C@]33C1=Nc1ccccc31)C\C2=C\C
: