Target
Nucleotide-binding oligomerization domain-containing protein 2
Ligand
BDBM50568936
Substrate
Meas. Tech.
ChEMBL_2107055 (CHEMBL4815730)
IC50
22±n/a nM
Citation
 Nikhar, SSiokas, ISchlicher, LLee, SGyrd-Hansen, MDegterev, ACuny, GD Design of pyrido[2,3-d]pyrimidin-7-one inhibitors of receptor interacting protein kinase-2 (RIPK2) and nucleotide-binding oligomerization domain (NOD) cell signaling. Eur J Med Chem 215:0 (2021)  
Target
Name:
Nucleotide-binding oligomerization domain-containing protein 2
Synonyms:
CARD15 IBD1 NOD2 Nucleotide-binding oligomerization domain-containing protein 2 | nucleotide-binding oligomerization domain containing 2
Type:
PROTEIN
Mol. Mass.:
115287.18
Organism:
Homo sapiens (Human)
Description:
ChEMBL_1454053
Residue:
1040
  
Inhibitor
Name:
BDBM50568936
Synonyms:
CHEMBL4864600
Type:
Small organic molecule
Emp. Form.:
C21H16Cl2N4O3S
Mol. Mass.:
475.348
SMILES:
Cn1c2nc(Nc3cccc(c3)S(C)(=O)=O)ncc2cc(-c2c(Cl)cccc2Cl)c1=O
: