Target
L-lactate dehydrogenase A chain
Ligand
BDBM489092
Substrate
Meas. Tech.
ChEMBL_2109295 (CHEMBL4817970)
Kd
0.004000±n/a nM
Citation
 Christov, PPKim, KJana, SRomaine, IMRai, GMott, BTAllweil, AALamers, ABrimacombe, KRUrban, DJLee, TDHu, XLukacs, CMDavies, DRJadhav, AHall, MDGreen, NMoore, WJStott, GMFlint, AJMaloney, DJSulikowski, GAWaterson, AG Optimization of ether and aniline based inhibitors of lactate dehydrogenase. Bioorg Med Chem Lett 41:0 (2021)  
Target
Name:
L-lactate dehydrogenase A chain
Synonyms:
Cell proliferation-inducing gene 19 protein L-lactate dehydrogenase A Chain LDH-A LDHA Lactate dehydrogenase A (LDHA) | Renal carcinoma antigen NY-REN-59
Type:
Protein
Mol. Mass.:
36694.85
Organism:
Homo sapiens (Human)
Description:
P00338::PDB Code: 4ajp
Residue:
332
  
Inhibitor
Name:
BDBM489092
Synonyms:
2-(3-(3- cydopropoxy-4- fluorophenyl)-5- (cyclopropylmethyl)- 4-(3-fluoro-4- sulfamoylbenzyl)- 1H-pyrazol-1- yl)thiazole-4- carboxylic acid; US11247971, Cmpd ID 471
Type:
Small organic molecule
Emp. Form.:
C27H24F2N4O5S2
Mol. Mass.:
586.63
SMILES:
NS(=O)(=O)c1ccc(Cc2c(CC3CC3)n(nc2-c2ccc(F)c(OC3CC3)c2)-c2nc(cs2)C(O)=O)cc1F
: