Target
L-lactate dehydrogenase A chain
Ligand
BDBM489093
Substrate
Meas. Tech.
ChEMBL_2109295 (CHEMBL4817970)
Kd
0.001000±n/a nM
Citation
 Christov, PPKim, KJana, SRomaine, IMRai, GMott, BTAllweil, AALamers, ABrimacombe, KRUrban, DJLee, TDHu, XLukacs, CMDavies, DRJadhav, AHall, MDGreen, NMoore, WJStott, GMFlint, AJMaloney, DJSulikowski, GAWaterson, AG Optimization of ether and aniline based inhibitors of lactate dehydrogenase. Bioorg Med Chem Lett 41:0 (2021)  
Target
Name:
L-lactate dehydrogenase A chain
Synonyms:
Cell proliferation-inducing gene 19 protein L-lactate dehydrogenase A Chain LDH-A LDHA Lactate dehydrogenase A (LDHA) | Renal carcinoma antigen NY-REN-59
Type:
Protein
Mol. Mass.:
36694.85
Organism:
Homo sapiens (Human)
Description:
P00338::PDB Code: 4ajp
Residue:
332
  
Inhibitor
Name:
BDBM489093
Synonyms:
2-(5- (cyclopropylmethyl)- 3-(4-fluoro-3-((5- (trifluoromethyl)furan- 2- yl)methoxy)phenyl)- 4-(3-fluoro-4- sulfamoylbenzyl)- 1H-pyrazol-1- yl)thiazole-4- carboxylic acid; MS (ES) 694.9 (M + H)+, US11247971, Cmpd ID 473
Type:
Small organic molecule
Emp. Form.:
C30H23F5N4O6S2
Mol. Mass.:
694.649
SMILES:
NS(=O)(=O)c1ccc(Cc2c(CC3CC3)n(nc2-c2ccc(F)c(OCc3ccc(o3)C(F)(F)F)c2)-c2nc(cs2)C(O)=O)cc1F
: