Target
L-lactate dehydrogenase A chain
Ligand
BDBM489104
Substrate
Meas. Tech.
ChEMBL_2109295 (CHEMBL4817970)
Kd
1.5±n/a nM
Citation
 Christov, PPKim, KJana, SRomaine, IMRai, GMott, BTAllweil, AALamers, ABrimacombe, KRUrban, DJLee, TDHu, XLukacs, CMDavies, DRJadhav, AHall, MDGreen, NMoore, WJStott, GMFlint, AJMaloney, DJSulikowski, GAWaterson, AG Optimization of ether and aniline based inhibitors of lactate dehydrogenase. Bioorg Med Chem Lett 41:0 (2021)  
Target
Name:
L-lactate dehydrogenase A chain
Synonyms:
Cell proliferation-inducing gene 19 protein L-lactate dehydrogenase A Chain LDH-A LDHA Lactate dehydrogenase A (LDHA) | Renal carcinoma antigen NY-REN-59
Type:
Protein
Mol. Mass.:
36694.85
Organism:
Homo sapiens (Human)
Description:
P00338::PDB Code: 4ajp
Residue:
332
  
Inhibitor
Name:
BDBM489104
Synonyms:
2-(5- (cyclopropylmethyl)- 3-(3- (phenylamino)phenyl)- 4-(4- sulfamoylbenzyl)- 1H-pyrazol-1- yl)thiazole-4- carboxylic acid; US11247971, Cmpd ID 485
Type:
Small organic molecule
Emp. Form.:
C30H27N5O4S2
Mol. Mass.:
585.696
SMILES:
NS(=O)(=O)c1ccc(Cc2c(CC3CC3)n(nc2-c2cccc(Nc3ccccc3)c2)-c2nc(cs2)C(O)=O)cc1
: