Target
Protein ADM2
Ligand
BDBM50570398
Substrate
Meas. Tech.
ChEMBL_2112107 (CHEMBL4820957)
IC50
126±n/a nM
Citation
 Zirimwabagabo, JOJailani, ABAAvgoustou, PTozer, MJGibson, KRGlossop, PAMills, JEJPorter, RABlaney, PWang, NSkerry, TMRichards, GOHarrity, JPA Discovery of a First-In-Class Small Molecule Antagonist against the Adrenomedullin-2 Receptor: Structure-Activity Relationships and Optimization. J Med Chem 64:3299-3319 (2021)  
Target
Name:
Protein ADM2
Synonyms:
ADM2 AM2
Type:
PROTEIN
Mol. Mass.:
15883.28
Organism:
Homo sapiens (Human)
Description:
ChEMBL_556927
Residue:
148
  
Inhibitor
Name:
BDBM50570398
Synonyms:
CHEMBL4861626
Type:
Small organic molecule
Emp. Form.:
C30H32N4O4
Mol. Mass.:
512.5995
SMILES:
CC(C)(C)C(=O)N(CC(=O)Nc1ccc2CC3(Cc2c1)C(=O)Nc1ncccc31)Cc1ccccc1CO
: