Target
Protein ADM2
Ligand
BDBM50570412
Substrate
Meas. Tech.
ChEMBL_2112107 (CHEMBL4820957)
IC50
794±n/a nM
Citation
 Zirimwabagabo, JOJailani, ABAAvgoustou, PTozer, MJGibson, KRGlossop, PAMills, JEJPorter, RABlaney, PWang, NSkerry, TMRichards, GOHarrity, JPA Discovery of a First-In-Class Small Molecule Antagonist against the Adrenomedullin-2 Receptor: Structure-Activity Relationships and Optimization. J Med Chem 64:3299-3319 (2021)  
Target
Name:
Protein ADM2
Synonyms:
ADM2 AM2
Type:
PROTEIN
Mol. Mass.:
15883.28
Organism:
Homo sapiens (Human)
Description:
ChEMBL_556927
Residue:
148
  
Inhibitor
Name:
BDBM50570412
Synonyms:
CHEMBL4853766
Type:
Small organic molecule
Emp. Form.:
C31H35N5O3
Mol. Mass.:
525.6413
SMILES:
CC(N(CC(=O)Nc1ccc2CC3(Cc2c1)C(=O)Nc1ncccc31)C(=O)C(C)(C)C)c1ccccc1CN
: