Target
Dual specificity tyrosine-phosphorylation-regulated kinase 1B
Ligand
BDBM50571345
Substrate
Meas. Tech.
ChEMBL_2114338 (CHEMBL4823188)
IC50
2.0±n/a nM
Citation
 Park, AHwang, JLee, JYHeo, EJNa, YJKang, SJeong, KSKim, KYShin, SJLee, H Synthesis of novel 1H-Pyrazolo[3,4-b]pyridine derivatives as DYRK 1A/1B inhibitors. Bioorg Med Chem Lett 47:0 (2021)  
Target
Name:
Dual specificity tyrosine-phosphorylation-regulated kinase 1B
Synonyms:
DYR1B_HUMAN Dual specificity tyrosine-phosphorylation-regulated kinase 1B MIRK
Type:
Enzyme
Mol. Mass.:
69222.24
Organism:
Homo sapiens (Human)
Description:
Q9Y463
Residue:
629
  
Inhibitor
Name:
BDBM50571345
Synonyms:
CHEMBL4872233
Type:
Small organic molecule
Emp. Form.:
C20H17N5O2
Mol. Mass.:
359.3813
SMILES:
COc1ccc(cc1)-c1n[nH]c2ncc(cc12)-c1ccc(NC(N)=O)cc1
: