Target
Ephrin type-A receptor 4
Ligand
BDBM223311
Substrate
Meas. Tech.
ChEMBL_2116084 (CHEMBL4825025)
Kd
400±n/a nM
Citation
 Baggio, CKulinich, ADennys, CNRodrigo, RMeyer, KEthell, IPellecchia, M NMR-Guided Design of Potent and Selective EphA4 Agonistic Ligands. J Med Chem 64:11229-11246 (2021)  
Target
Name:
Ephrin type-A receptor 4
Synonyms:
EPHA4 Ephrin receptor HEK8 TYRO1
Type:
PROTEIN
Mol. Mass.:
109859.29
Organism:
Homo sapiens (Human)
Description:
ChEMBL_586961
Residue:
986
  
Inhibitor
Name:
BDBM223311
Synonyms:
123C4
Type:
Small organic molecule
Emp. Form.:
C43H47ClN8O6
Mol. Mass.:
807.336
SMILES:
COc1ccc2[nH]cc(CCNC(=O)[C@H](Cc3ccncc3)NC(=O)[C@H](Cc3ccc(Cl)cc3)NC(=O)[C@H](Cc3c[nH]c4ccc(O)cc34)NC(=O)CCCN)c2c1
: