Target
Ephrin type-A receptor 3
Ligand
BDBM223311
Substrate
Meas. Tech.
ChEMBL_2116086 (CHEMBL4825027)
Kd
>10000±n/a nM
Citation
 Baggio, CKulinich, ADennys, CNRodrigo, RMeyer, KEthell, IPellecchia, M NMR-Guided Design of Potent and Selective EphA4 Agonistic Ligands. J Med Chem 64:11229-11246 (2021)  
Target
Name:
Ephrin type-A receptor 3
Synonyms:
EPHA3 ETK Ephrin receptor Ephrin type-A receptor 3 (EPHA3) TYRO4
Type:
Protein
Mol. Mass.:
110131.95
Organism:
Homo sapiens (Human)
Description:
P29320
Residue:
983
  
Inhibitor
Name:
BDBM223311
Synonyms:
123C4
Type:
Small organic molecule
Emp. Form.:
C43H47ClN8O6
Mol. Mass.:
807.336
SMILES:
COc1ccc2[nH]cc(CCNC(=O)[C@H](Cc3ccncc3)NC(=O)[C@H](Cc3ccc(Cl)cc3)NC(=O)[C@H](Cc3c[nH]c4ccc(O)cc34)NC(=O)CCCN)c2c1
: