Target
Galectin-4
Ligand
BDBM50572244
Substrate
Meas. Tech.
ChEMBL_2116634 (CHEMBL4825575)
Kd
>1000000±n/a nM
Citation
 Hassan, MBaussière, FGuzelj, SSundin, APHåkansson, MKova?i?, RLeffler, HToma?i?, TAnderluh, MJakopin, ?Nilsson, UJ Structure-Guided Design of d-Galactal Derivatives with High Affinity and Selectivity for the Galectin-8 N-Terminal Domain. ACS Med Chem Lett 12:1745-1752 (2021)  
Target
Name:
Galectin-4
Synonyms:
Antigen NY-CO-27 L-36 lactose-binding protein LEG4_HUMAN Lactose-binding lectin 4
Type:
PROTEIN
Mol. Mass.:
35952.28
Organism:
Homo sapiens (Human)
Description:
ChEMBL_716454
Residue:
323
  
Inhibitor
Name:
BDBM50572244
Synonyms:
CHEMBL4862920
Type:
Small organic molecule
Emp. Form.:
C18H17FO4
Mol. Mass.:
316.3236
SMILES:
[H][C@]12OCc3cc(Cc4ccc(F)cc4)cc(O[C@H](CO)[C@@H]1O)c23
: