Target
Galectin-4
Ligand
BDBM50572246
Substrate
Meas. Tech.
ChEMBL_2116634 (CHEMBL4825575)
Kd
1700000±n/a nM
Citation
 Hassan, MBaussière, FGuzelj, SSundin, APHåkansson, MKova?i?, RLeffler, HToma?i?, TAnderluh, MJakopin, ?Nilsson, UJ Structure-Guided Design of d-Galactal Derivatives with High Affinity and Selectivity for the Galectin-8 N-Terminal Domain. ACS Med Chem Lett 12:1745-1752 (2021)  
Target
Name:
Galectin-4
Synonyms:
Antigen NY-CO-27 L-36 lactose-binding protein LEG4_HUMAN Lactose-binding lectin 4
Type:
PROTEIN
Mol. Mass.:
35952.28
Organism:
Homo sapiens (Human)
Description:
ChEMBL_716454
Residue:
323
  
Inhibitor
Name:
BDBM50572246
Synonyms:
CHEMBL4846264
Type:
Small organic molecule
Emp. Form.:
C17H20N2O6
Mol. Mass.:
348.3505
SMILES:
COC(=O)c1ccc2nc(CO[C@@H]3C=CO[C@H](CO)[C@@H]3O)n(C)c2c1
: