Target
Galectin-4
Ligand
BDBM50572251
Substrate
Meas. Tech.
ChEMBL_2116634 (CHEMBL4825575)
Kd
1400000±n/a nM
Citation
 Hassan, MBaussière, FGuzelj, SSundin, APHåkansson, MKova?i?, RLeffler, HToma?i?, TAnderluh, MJakopin, ?Nilsson, UJ Structure-Guided Design of d-Galactal Derivatives with High Affinity and Selectivity for the Galectin-8 N-Terminal Domain. ACS Med Chem Lett 12:1745-1752 (2021)  
Target
Name:
Galectin-4
Synonyms:
Antigen NY-CO-27 L-36 lactose-binding protein LEG4_HUMAN Lactose-binding lectin 4
Type:
PROTEIN
Mol. Mass.:
35952.28
Organism:
Homo sapiens (Human)
Description:
ChEMBL_716454
Residue:
323
  
Inhibitor
Name:
BDBM50572251
Synonyms:
CHEMBL4860539
Type:
Small organic molecule
Emp. Form.:
C15H16N2O6
Mol. Mass.:
320.2973
SMILES:
OC[C@H]1OC=C[C@@H](OCc2nc3ccc(cc3[nH]2)C(O)=O)[C@H]1O
: