Target
Galectin-4
Ligand
BDBM50572245
Substrate
Meas. Tech.
ChEMBL_2116635 (CHEMBL4825576)
Kd
5300000±n/a nM
Citation
 Hassan, MBaussière, FGuzelj, SSundin, APHåkansson, MKova?i?, RLeffler, HToma?i?, TAnderluh, MJakopin, ?Nilsson, UJ Structure-Guided Design of d-Galactal Derivatives with High Affinity and Selectivity for the Galectin-8 N-Terminal Domain. ACS Med Chem Lett 12:1745-1752 (2021)  
Target
Name:
Galectin-4
Synonyms:
Antigen NY-CO-27 L-36 lactose-binding protein LEG4_HUMAN Lactose-binding lectin 4
Type:
PROTEIN
Mol. Mass.:
35952.28
Organism:
Homo sapiens (Human)
Description:
ChEMBL_716454
Residue:
323
  
Inhibitor
Name:
BDBM50572245
Synonyms:
CHEBI:63139 | CHEMBL2115530
Type:
Small organic molecule
Emp. Form.:
C6H10O4
Mol. Mass.:
146.1412
SMILES:
OC[C@H]1OC=C[C@@H](O)[C@H]1O
: