Target
Galectin-4
Ligand
BDBM50243888
Substrate
Meas. Tech.
ChEMBL_2116635 (CHEMBL4825576)
Kd
1000000±n/a nM
Citation
 Hassan, MBaussière, FGuzelj, SSundin, APHåkansson, MKova?i?, RLeffler, HToma?i?, TAnderluh, MJakopin, ?Nilsson, UJ Structure-Guided Design of d-Galactal Derivatives with High Affinity and Selectivity for the Galectin-8 N-Terminal Domain. ACS Med Chem Lett 12:1745-1752 (2021)  
Target
Name:
Galectin-4
Synonyms:
Antigen NY-CO-27 L-36 lactose-binding protein LEG4_HUMAN Lactose-binding lectin 4
Type:
PROTEIN
Mol. Mass.:
35952.28
Organism:
Homo sapiens (Human)
Description:
ChEMBL_716454
Residue:
323
  
Inhibitor
Name:
BDBM50243888
Synonyms:
CHEMBL442951 methyl beta-D-galactoside
Type:
Small organic molecule
Emp. Form.:
C7H14O6
Mol. Mass.:
194.1825
SMILES:
CO[C@@H]1O[C@H](CO)[C@H](O)[C@H](O)[C@H]1O
: