Target
Peroxisomal acyl-coenzyme A oxidase 1
Ligand
BDBM50138621
Substrate
Meas. Tech.
ChEBML_154606
IC50
4400±n/a nM
Citation
 Koltun, DOMarquart, TAShenk, KDElzein, ELi, YNguyen, MKerwar, SZeng, DChu, NSoohoo, DHao, JMaydanik, VYLustig, DANg, KJFraser, HZablocki, JA New fatty acid oxidation inhibitors with increased potency lacking adverse metabolic and electrophysiological properties. Bioorg Med Chem Lett 14:549-52 (2003)  
Target
Name:
Peroxisomal acyl-coenzyme A oxidase 1
Synonyms:
ACOX1_RAT Acox Palmitoyl-CoA oxidase Peroxisomal acyl-CoA oxidase 1, B chain Peroxisomal acyl-coenzyme A oxidase 1
Type:
PROTEIN
Mol. Mass.:
74693.04
Organism:
Rattus norvegicus
Description:
ChEMBL_311972
Residue:
661
  
Inhibitor
Name:
BDBM50138621
Synonyms:
2-{4-[(R)-2-Hydroxy-3-(2-methyl-benzothiazol-5-yloxy)-propyl]-piperazin-1-yl}-N-((S)-1-phenyl-ethyl)-acetamide | CHEMBL356634
Type:
Small organic molecule
Emp. Form.:
C25H32N4O3S
Mol. Mass.:
468.612
SMILES:
C[C@H](NC(=O)CN1CCN(C[C@@H](O)COc2ccc3sc(C)nc3c2)CC1)c1ccccc1
: