Target
72 kDa type IV collagenase
Ligand
BDBM50082556
Substrate
Meas. Tech.
ChEMBL_104396 (CHEMBL714999)
Ki
0.050±n/a nM
Citation
 Matziari, MBeau, FCuniasse, PDive, VYiotakis, A Evaluation of P1'-diversified phosphinic peptides leads to the development of highly selective inhibitors of MMP-11. J Med Chem 47:325-36 (2004)  
Target
Name:
72 kDa type IV collagenase
Synonyms:
72 kDa gelatinase CLG4A Gelatinase A (MMP-2) MMP2_HUMAN Matrix metalloproteinase-2 (MMP 2) Matrix metalloproteinases 2 (MMP-2) | TBE-1
Type:
Enzyme
Mol. Mass.:
73870.36
Organism:
Homo sapiens (Human)
Description:
P08253
Residue:
660
  
Inhibitor
Name:
BDBM50082556
Synonyms:
(S)-2,2-Dimethyl-4-[4-(pyridin-4-yloxy)-benzenesulfonyl]-thiomorpholine-3-carboxylic acid hydroxyamide 2,2-Dimethyl-4-[4-(pyridin-4-yloxy)-benzenesulfonyl]-thiomorpholine-3-carboxylic acid hydroxyamide 2,2-Dimethyl-4-[4-(pyridin-4-yloxy)-benzenesulfonyl]-thiomorpholine-3-carboxylic acid hydroxyamide(prinomastat) CHEMBL75094 | Prinomastat
Type:
Small organic molecule
Emp. Form.:
C18H21N3O5S2
Mol. Mass.:
423.506
SMILES:
CC1(C)SCCN([C@H]1C(=O)NO)S(=O)(=O)c1ccc(Oc2ccncc2)cc1
: