Target
Bifunctional dihydrofolate reductase-thymidylate synthase
Ligand
BDBM18786
Substrate
Meas. Tech.
ChEMBL_155798 (CHEMBL760860)
IC50
3600±n/a nM
Citation
 Kamchonwongpaisan, SQuarrell, RCharoensetakul, NPonsinet, RVilaivan, TVanichtanankul, JTarnchompoo, BSirawaraporn, WLowe, GYuthavong, Y Inhibitors of multiple mutants of Plasmodium falciparum dihydrofolate reductase and their antimalarial activities. J Med Chem 47:673-80 (2004)  
Target
Name:
Bifunctional dihydrofolate reductase-thymidylate synthase
Synonyms:
DHFR-TS Dihydrofolate Reductase-Thymidylate Synthase (DHFR-TS) Mutant KICB1 PfDHFR-TS double mutant (C59R+S108N)
Type:
Enzyme
Mol. Mass.:
71822.51
Organism:
Plasmodium falciparum (isolate K1 / Thailand)
Description:
The mutant clone was prepared by cassette mutagenesis using wildtype pfDHFR as a template, and expressed in E. coli.
Residue:
608
  
Inhibitor
Name:
BDBM18786
Synonyms:
5-(3-chlorophenyl)-6-(3-phenylpropyl)pyrimidine-2,4-diamine P31
Type:
Small organic molecule
Emp. Form.:
C19H19ClN4
Mol. Mass.:
338.834
SMILES:
Nc1nc(N)c(c(CCCc2ccccc2)n1)-c1cccc(Cl)c1
: