Target
Genome polyprotein/Non-structural protein 4A
Ligand
BDBM50573886
Substrate
Meas. Tech.
ChEMBL_2121159 (CHEMBL4830306)
Ki
0.500000±n/a nM
Citation
 Nageswara Rao, DZephyr, JHenes, MChan, ETMatthew, ANHedger, AKConway, HLSaeed, MNewton, APetropoulos, CJHuang, WKurt Yilmaz, NSchiffer, CAAli, A Discovery of Quinoxaline-Based P1-P3 Macrocyclic NS3/4A Protease Inhibitors with Potent Activity against Drug-Resistant Hepatitis C Virus Variants. J Med Chem 64:11972-11989 (2021)  
Target
Name:
Genome polyprotein/Non-structural protein 4A
Synonyms:
Hepatitis C virus serine protease, NS3/NS4A
Type:
Mol. Mass.:
Description:
ASSAY_ID of ChEMBL is 1969955
Components:
This complex has 2 components.
Component 1
Name:
Non-structural protein 4A
Synonyms:
Hepatitis C virus NS4A protein Non-structural protein 4A
Type:
PROTEIN
Mol. Mass.:
5762.65
Organism:
Hepatitis C virus
Description:
ChEMBL_305334
Residue:
54
  
Component 2
Name:
Genome polyprotein
Synonyms:
Hepatitis C virus NS3 protease/helicase | Hepatitis C virus serine protease, NS3/NS4A
Type:
Protein
Mol. Mass.:
67067.41
Organism:
Hepatitis C virus
Description:
A3EZI9
Residue:
631
  
Inhibitor
Name:
BDBM50573886
Synonyms:
CHEMBL4848452
Type:
Small organic molecule
Emp. Form.:
C39H50N6O9S
Mol. Mass.:
778.914
SMILES:
[H][C@@]12C[C@]1([H])CC(C2)OC(=O)N[C@H]1CCCCC\C=C\[C@@H]2C[C@]2(NC(=O)[C@@H]2C[C@H](CN2C1=O)Oc1nc2cc(OC)ccc2nc1C)C(=O)NS(=O)(=O)C1(C)CC1
: