Target
Genome polyprotein/Non-structural protein 4A
Ligand
BDBM50573920
Substrate
Meas. Tech.
ChEMBL_2121159 (CHEMBL4830306)
Ki
3.0±n/a nM
Citation
 Nageswara Rao, DZephyr, JHenes, MChan, ETMatthew, ANHedger, AKConway, HLSaeed, MNewton, APetropoulos, CJHuang, WKurt Yilmaz, NSchiffer, CAAli, A Discovery of Quinoxaline-Based P1-P3 Macrocyclic NS3/4A Protease Inhibitors with Potent Activity against Drug-Resistant Hepatitis C Virus Variants. J Med Chem 64:11972-11989 (2021)  
Target
Name:
Genome polyprotein/Non-structural protein 4A
Synonyms:
Hepatitis C virus serine protease, NS3/NS4A
Type:
Mol. Mass.:
Description:
ASSAY_ID of ChEMBL is 1969955
Components:
This complex has 2 components.
Component 1
Name:
Non-structural protein 4A
Synonyms:
Hepatitis C virus NS4A protein Non-structural protein 4A
Type:
PROTEIN
Mol. Mass.:
5762.65
Organism:
Hepatitis C virus
Description:
ChEMBL_305334
Residue:
54
  
Component 2
Name:
Genome polyprotein
Synonyms:
Hepatitis C virus NS3 protease/helicase | Hepatitis C virus serine protease, NS3/NS4A
Type:
Protein
Mol. Mass.:
67067.41
Organism:
Hepatitis C virus
Description:
A3EZI9
Residue:
631
  
Inhibitor
Name:
BDBM50573920
Synonyms:
CHEMBL4876441
Type:
Small organic molecule
Emp. Form.:
C38H49F3N6O9S
Mol. Mass.:
822.891
SMILES:
COc1ccc2nc(O[C@@H]3C[C@@H]4N(C3)C(=O)[C@H](CCCCC\C=C\[C@@H]3C[C@]3(NC4=O)C(=O)NS(=O)(=O)C3(C)CC3)NC(=O)O[C@H](C)C(C)C)c(nc2c1)C(F)(F)F
: