Target
Cyclin-dependent kinase 3/G1/S-specific cyclin-E1
Ligand
BDBM50573930
Substrate
Meas. Tech.
ChEMBL_2121251 (CHEMBL4830398)
IC50
51±n/a nM
Citation
 Huang, JWang, XDong, RLiu, XLi, HZhang, TXu, JLiu, CZhang, YHou, STang, WLu, TChen, Y Discovery of  J Med Chem 64:12548-12571 (2021)  
Target
Name:
Cyclin-dependent kinase 3/G1/S-specific cyclin-E1
Synonyms:
CDK3/Cyclin E | CDK3/E
Type:
Protein
Mol. Mass.:
Description:
Components:
This complex has 2 components.
Component 1
Name:
Cyclin-dependent kinase 3
Synonyms:
CDK3 CDK3_HUMAN Cyclin-dependent kinase 3 | Cyclin-dependent kinase 3 (CDK3)
Type:
Enzyme
Mol. Mass.:
35053.88
Organism:
Homo sapiens (Human)
Description:
Q00526
Residue:
305
  
Component 2
Name:
G1/S-specific cyclin-E1
Synonyms:
CCNE CCNE1_HUMAN
Type:
Enzyme Subunit
Mol. Mass.:
47073.17
Organism:
Homo sapiens (Human)
Description:
Residue:
410
  
Inhibitor
Name:
BDBM50573930
Synonyms:
CHEMBL4856177
Type:
Small organic molecule
Emp. Form.:
C29H32N8
Mol. Mass.:
492.618
SMILES:
CC(C)c1n(C)nc2ccc(cc12)-c1ccnc(Nc2ccc3c(ccnc3c2)N2CCN(C)CC2)n1
: