Target
Galectin-4
Ligand
BDBM50574702
Substrate
Meas. Tech.
ChEMBL_2123011 (CHEMBL4832244)
Kd
160000±n/a nM
Citation
 Hassan, Mvan Klaveren, SHåkansson, MDiehl, CKova?i?, RBaussière, FSundin, APDernov?ek, JWalse, BZetterberg, FLeffler, HAnderluh, MToma?i?, TJakopin, ?Nilsson, UJ Benzimidazole-galactosides bind selectively to the Galectin-8 N-Terminal domain: Structure-based design and optimisation. Eur J Med Chem 223:0 (2021)  
Target
Name:
Galectin-4
Synonyms:
Antigen NY-CO-27 L-36 lactose-binding protein LEG4_HUMAN Lactose-binding lectin 4
Type:
PROTEIN
Mol. Mass.:
35952.28
Organism:
Homo sapiens (Human)
Description:
ChEMBL_716454
Residue:
323
  
Inhibitor
Name:
BDBM50574702
Synonyms:
CHEMBL4872829
Type:
Small organic molecule
Emp. Form.:
C21H20Cl2N2O7S
Mol. Mass.:
515.364
SMILES:
OC[C@H]1O[C@H](Sc2ccc(Cl)c(Cl)c2)[C@H](O)[C@@H](OCc2nc3ccc(cc3[nH]2)C(O)=O)[C@H]1O
: