Target
Lysine-specific demethylase 6A
Ligand
BDBM50574750
Substrate
Meas. Tech.
ChEMBL_2123094 (CHEMBL4832327)
IC50
37080±n/a nM
Citation
 Fang, ZLiu, YZhang, RChen, QWang, TYang, WFan, YYu, CXiang, RYang, S Discovery of a potent and selective inhibitor of histone lysine demethylase KDM4D. Eur J Med Chem 223:0 (2021)  
Target
Name:
Lysine-specific demethylase 6A
Synonyms:
Histone demethylase UTX KDM6A_HUMAN Lysine-specific demethylase 6A (KDM6A(UTX)) UTX Ubiquitously-transcribed X chromosome tetratricopeptide repeat protein
Type:
Protein
Mol. Mass.:
154198.48
Organism:
Homo sapiens (Human)
Description:
O15550
Residue:
1401
  
Inhibitor
Name:
BDBM50574750
Synonyms:
CHEMBL4850758
Type:
Small organic molecule
Emp. Form.:
C28H31N3O5
Mol. Mass.:
489.5628
SMILES:
CC(C)(C)OC(=O)N[C@@H]1CCN(C1)C(c1ccc(cc1)-c1ccncc1)c1cc2OCOc2cc1O
: