Target
Voltage-dependent calcium channel subunit alpha-2/delta-1
Ligand
BDBM50140629
Substrate
Meas. Tech.
ChEBML_32533
IC50
148±n/a nM
Citation
 Stearns, BAAnker, NArruda, JMCampbell, BTChen, CCramer, MHu, TJiang, XPark, KRen, KKSablad, MSantini, ASchaffhauser, HUrban, MOMunoz, B Synthesis and biological evaluation of 6-aryl-6H-pyrrolo[3,4-d]pyridazine derivatives: high-affinity ligands to the alpha 2 delta subunit of voltage gated calcium channels. Bioorg Med Chem Lett 14:1295-8 (2004)  
Target
Name:
Voltage-dependent calcium channel subunit alpha-2/delta-1
Synonyms:
CA2D1_HUMAN CACNL2A MHS3 Voltage-dependent calcium channel subunit delta-1 Voltage-gated calcium channel alpha2/delta subunit 1 | Voltage-gated calcium channel subunit alpha-2/delta-1
Type:
Enzyme
Mol. Mass.:
124544.88
Organism:
Homo sapiens (Human)
Description:
P54289
Residue:
1103
  
Inhibitor
Name:
BDBM50140629
Synonyms:
1-(2-Cyclopentyl-ethyl)-6-(4-ethoxy-phenyl)-4,5,7-trimethyl-6H-pyrrolo[3,4-d]pyridazine | CHEMBL24440
Type:
Small organic molecule
Emp. Form.:
C24H31N3O
Mol. Mass.:
377.5224
SMILES:
CCOc1ccc(cc1)-n1c(C)c2c(C)nnc(CCC3CCCC3)c2c1C
: