Target
Multidrug resistance-associated protein 1
Ligand
BDBM50140825
Substrate
Meas. Tech.
ChEMBL_103770 (CHEMBL714116)
IC50
61±n/a nM
Citation
 Wang, SFolkes, AChuckowree, ICockcroft, XSohal, SMiller, WMilton, JWren, SPVicker, NDepledge, PScott, JSmith, LJones, HMistry, PFaint, RThompson, DCocks, S Studies on pyrrolopyrimidines as selective inhibitors of multidrug-resistance-associated protein in multidrug resistance. J Med Chem 47:1329-38 (2004)  
Target
Name:
Multidrug resistance-associated protein 1
Synonyms:
7.6.2.2 ABCC1 ATP-binding cassette, sub-family C, member 1 isoform 1 LTC4 transporter MRP MRP1_HUMAN
Type:
Mol. Mass.:
171597.72
Organism:
Homo sapiens (Human)
Description:
P33527
Residue:
1531
  
Inhibitor
Name:
BDBM50140825
Synonyms:
4-{4-[2-(3,4-Difluoro-phenyl)-ethyl]-piperazin-1-yl}-6,7,8,9-tetrahydro-pyrimido[4,5-b]indolizine-10-carboxylic acid (pyridin-2-ylmethyl)-amide | CHEMBL26485
Type:
Small organic molecule
Emp. Form.:
C29H31F2N7O
Mol. Mass.:
531.5995
SMILES:
Fc1ccc(CCN2CCN(CC2)c2ncnc3c(C(=O)NCc4ccccn4)c4CCCCn4c23)cc1F
: