Target
Multidrug resistance-associated protein 1
Ligand
BDBM50140803
Substrate
Meas. Tech.
ChEMBL_103774 (CHEMBL714754)
IC50
9730±n/a nM
Citation
 Wang, SFolkes, AChuckowree, ICockcroft, XSohal, SMiller, WMilton, JWren, SPVicker, NDepledge, PScott, JSmith, LJones, HMistry, PFaint, RThompson, DCocks, S Studies on pyrrolopyrimidines as selective inhibitors of multidrug-resistance-associated protein in multidrug resistance. J Med Chem 47:1329-38 (2004)  
Target
Name:
Multidrug resistance-associated protein 1
Synonyms:
ATP-binding cassette sub-family C member 1 Abcc1a Cytochrome P450 3A Leukotriene C(4) transporter Mdrap | Mrp
Type:
PROTEIN
Mol. Mass.:
171196.71
Organism:
Mus musculus
Description:
ChEMBL_10946
Residue:
1528
  
Inhibitor
Name:
BDBM50140803
Synonyms:
4-{4-[2-(3,4-Difluoro-phenyl)-ethyl]-piperazin-1-yl}-6,7,8,9-tetrahydro-pyrimido[4,5-b]indolizine-10-carboxylic acid pyridin-3-ylamide | CHEMBL280981
Type:
Small organic molecule
Emp. Form.:
C28H29F2N7O
Mol. Mass.:
517.573
SMILES:
Fc1ccc(CCN2CCN(CC2)c2ncnc3c(C(=O)Nc4cccnc4)c4CCCCn4c23)cc1F
: