Target
Multidrug resistance-associated protein 1
Ligand
BDBM50140806
Substrate
Meas. Tech.
ChEMBL_103774 (CHEMBL714754)
IC50
45800±n/a nM
Citation
 Wang, SFolkes, AChuckowree, ICockcroft, XSohal, SMiller, WMilton, JWren, SPVicker, NDepledge, PScott, JSmith, LJones, HMistry, PFaint, RThompson, DCocks, S Studies on pyrrolopyrimidines as selective inhibitors of multidrug-resistance-associated protein in multidrug resistance. J Med Chem 47:1329-38 (2004)  
Target
Name:
Multidrug resistance-associated protein 1
Synonyms:
ATP-binding cassette sub-family C member 1 Abcc1a Cytochrome P450 3A Leukotriene C(4) transporter Mdrap | Mrp
Type:
PROTEIN
Mol. Mass.:
171196.71
Organism:
Mus musculus
Description:
ChEMBL_10946
Residue:
1528
  
Inhibitor
Name:
BDBM50140806
Synonyms:
4-{4-[2-(3,4-Difluoro-phenyl)-ethyl]-piperazin-1-yl}-6,7,8,9-tetrahydro-pyrimido[4,5-b]indolizine-10-carboxylic acid amide | CHEMBL26599
Type:
Small organic molecule
Emp. Form.:
C23H26F2N6O
Mol. Mass.:
440.4889
SMILES:
NC(=O)c1c2CCCCn2c2c(ncnc12)N1CCN(CCc2ccc(F)c(F)c2)CC1
: