Target
Multidrug resistance-associated protein 1
Ligand
BDBM50140853
Substrate
Meas. Tech.
ChEMBL_103771 (CHEMBL714751)
IC50
28±n/a nM
Citation
 Wang, SWan, NCHarrison, JMiller, WChuckowree, ISohal, SHancox, TCBaker, SFolkes, AWilson, FThompson, DCocks, SFarmer, HBoyce, AFreathy, CBroadbridge, JScott, JDepledge, PFaint, RMistry, PCharlton, P Design and synthesis of new templates derived from pyrrolopyrimidine as selective multidrug-resistance-associated protein inhibitors in multidrug resistance. J Med Chem 47:1339-50 (2004)  
Target
Name:
Multidrug resistance-associated protein 1
Synonyms:
7.6.2.2 ABCC1 ATP-binding cassette, sub-family C, member 1 isoform 1 LTC4 transporter MRP MRP1_HUMAN
Type:
Mol. Mass.:
171597.72
Organism:
Homo sapiens (Human)
Description:
P33527
Residue:
1531
  
Inhibitor
Name:
BDBM50140853
Synonyms:
(4-{4-[2-(3,4-Difluoro-phenyl)-ethyl]-piperazin-1-yl}-5-methyl-5H-pyrido[3',4':4,5]pyrrolo[3,2-d]pyrimidin-9-yl)-methyl-amine | CHEMBL25731
Type:
Small organic molecule
Emp. Form.:
C23H25F2N7
Mol. Mass.:
437.4883
SMILES:
CNc1nccc2n(C)c3c(ncnc3c12)N1CCN(CCc2ccc(F)c(F)c2)CC1
: