Target
Multidrug resistance-associated protein 1
Ligand
BDBM50140846
Substrate
Meas. Tech.
ChEMBL_103771 (CHEMBL714751)
IC50
20±n/a nM
Citation
 Wang, SWan, NCHarrison, JMiller, WChuckowree, ISohal, SHancox, TCBaker, SFolkes, AWilson, FThompson, DCocks, SFarmer, HBoyce, AFreathy, CBroadbridge, JScott, JDepledge, PFaint, RMistry, PCharlton, P Design and synthesis of new templates derived from pyrrolopyrimidine as selective multidrug-resistance-associated protein inhibitors in multidrug resistance. J Med Chem 47:1339-50 (2004)  
Target
Name:
Multidrug resistance-associated protein 1
Synonyms:
7.6.2.2 ABCC1 ATP-binding cassette, sub-family C, member 1 isoform 1 LTC4 transporter MRP MRP1_HUMAN
Type:
Mol. Mass.:
171597.72
Organism:
Homo sapiens (Human)
Description:
P33527
Residue:
1531
  
Inhibitor
Name:
BDBM50140846
Synonyms:
4-{4-[2-(3,4-Difluoro-phenyl)-ethyl]-piperazin-1-yl}-5-pyridin-4-ylmethyl-5H-pyrimido[5,4-b]indole-9-carboxylic acid amide | CHEMBL283255
Type:
Small organic molecule
Emp. Form.:
C29H27F2N7O
Mol. Mass.:
527.5678
SMILES:
NC(=O)c1cccc2n(Cc3ccncc3)c3c(ncnc3c12)N1CCN(CCc2ccc(F)c(F)c2)CC1
: