Target
Multidrug resistance-associated protein 1
Ligand
BDBM50140866
Substrate
Meas. Tech.
ChEMBL_103771 (CHEMBL714751)
IC50
59±n/a nM
Citation
 Wang, SWan, NCHarrison, JMiller, WChuckowree, ISohal, SHancox, TCBaker, SFolkes, AWilson, FThompson, DCocks, SFarmer, HBoyce, AFreathy, CBroadbridge, JScott, JDepledge, PFaint, RMistry, PCharlton, P Design and synthesis of new templates derived from pyrrolopyrimidine as selective multidrug-resistance-associated protein inhibitors in multidrug resistance. J Med Chem 47:1339-50 (2004)  
Target
Name:
Multidrug resistance-associated protein 1
Synonyms:
7.6.2.2 ABCC1 ATP-binding cassette, sub-family C, member 1 isoform 1 LTC4 transporter MRP MRP1_HUMAN
Type:
Mol. Mass.:
171597.72
Organism:
Homo sapiens (Human)
Description:
P33527
Residue:
1531
  
Inhibitor
Name:
BDBM50140866
Synonyms:
4-{4-[2-(3,4-Difluoro-phenyl)-ethyl]-piperazin-1-yl}-5H-pyrimido[5,4-b]indole-8-carboxylic acid methyl ester | CHEMBL27257
Type:
Small organic molecule
Emp. Form.:
C24H23F2N5O2
Mol. Mass.:
451.4685
SMILES:
COC(=O)c1ccc2[nH]c3c(ncnc3c2c1)N1CCN(CCc2ccc(F)c(F)c2)CC1
: